{"text_format":"1","workbook":"xlsx","n_sheets":4,"sheets":["กรุณาส่ง","Sheet1","Sheet2","คู่มือการใช้"],"not_rendered":{"charts":0,"images":0,"macros":1,"external_links":0,"defined_names":4,"comments":0,"pivot_tables":0},"unopened":[],"bounds":{"document_bytes":16777216,"sheet_cells":100000,"rows_first":2000,"rows_last":500,"rows_between":2000,"halvings":0,"cell_chars":16384,"cell_head_chars":4096},"cells_cut":0,"cells_raw":0,"read":"whole","date_system":"1900"}

{"sheet":"กรุณาส่ง","index":0,"n_rows":5,"n_cols":3,"rows_kept":5,"cut":false,"hidden":false,"merged":[]}
[null,"*หมายเหตุ  ท่านจำเป็นต้องส่งแผนบำรุงรักษา 2 ช่องทาง ดังนี้"]
[null,"1. บริษัทฯ ใช้แบบฟอร์มนี้แจ้งวันหยุดบำรุงรักษา และส่งจดหมายให้ กฟผ.ทางช่องทางปกติ ตามเดิม"]
[null,"2. ขอความร่วมมือบริษัทฯ ส่ง Soft file ที่ได้กรอกวันบำรุงรักษาแล้ว พร้อม scan จดหมายตามข้อ 1 ส่ง Email มาที่ "]
[null,"-",{"$f":"Sheet1!B12","v":"Tonsakul.Kavownark@egat.co.th"}]
[null,"-",{"$f":"Sheet1!B13","v":"            Ltop@egat.co.th"}]

{"sheet":"Sheet1","index":1,"n_rows":123,"n_cols":26,"rows_kept":123,"cut":false,"hidden":false,"merged":[[14,0,14,5],[118,10,118,11],[119,10,119,11],[120,10,120,11],[121,10,121,11],[122,10,122,11],[113,10,113,11],[114,10,114,11],[115,10,115,11],[116,10,116,11],[117,10,117,11],[108,10,108,11],[109,10,109,11],[110,10,110,11],[111,10,111,11],[112,10,112,11],[103,10,103,11],[104,10,104,11],[105,10,105,11],[106,10,106,11],[107,10,107,11],[98,10,98,11],[99,10,99,11],[100,10,100,11],[101,10,101,11],[102,10,102,11],[93,10,93,11],[94,10,94,11],[95,10,95,11],[96,10,96,11],[97,10,97,11],[88,10,88,11],[89,10,89,11],[90,10,90,11],[91,10,91,11],[92,10,92,11],[83,10,83,11],[84,10,84,11],[85,10,85,11],[86,10,86,11],[87,10,87,11],[78,10,78,11],[79,10,79,11],[80,10,80,11],[81,10,81,11],[82,10,82,11],[73,10,73,11],[74,10,74,11],[75,10,75,11],[76,10,76,11],[77,10,77,11],[68,10,68,11],[69,10,69,11],[70,10,70,11],[71,10,71,11],[72,10,72,11],[63,10,63,11],[64,10,64,11],[65,10,65,11],[66,10,66,11],[67,10,67,11],[58,10,58,11],[59,10,59,11],[60,10,60,11],[61,10,61,11],[62,10,62,11],[53,10,53,11],[54,10,54,11],[55,10,55,11],[56,10,56,11],[57,10,57,11],[48,10,48,11],[49,10,49,11],[50,10,50,11],[51,10,51,11],[52,10,52,11],[43,10,43,11],[44,10,44,11],[45,10,45,11],[46,10,46,11],[47,10,47,11],[39,10,39,11],[40,10,40,11],[41,10,41,11],[42,10,42,11],[36,10,36,11],[37,10,37,11],[30,10,30,11],[31,10,31,11],[32,10,32,11],[23,10,23,11],[24,10,24,11],[25,10,25,11],[26,10,26,11],[27,10,27,11],[38,10,38,11],[15,0,15,5],[16,0,16,5],[17,0,17,5],[19,0,19,10],[20,0,22,0],[20,1,22,1],[20,8,20,9],[28,10,28,11],[29,10,29,11],[20,10,22,11],[20,2,22,2],[20,3,20,4],[21,3,22,3],[21,4,22,4],[20,5,22,5],[20,6,20,7],[21,6,22,6],[21,7,22,7],[21,8,22,8],[21,9,22,9],[33,10,33,11],[34,10,34,11],[35,10,35,11],[2,18,4,18],[19,17,19,18],[19,19,19,21],[15,17,15,18],[15,19,15,21],[16,17,16,18],[16,19,16,21],[17,17,17,18],[17,19,17,21],[13,17,13,18],[13,19,13,21],[14,17,14,18],[14,19,14,21],[2,0,2,1],[2,2,2,3],[0,0,1,3],[4,2,4,3],[5,2,5,3],[6,2,6,3],[7,2,7,3],[8,2,8,3],[13,0,13,1],[3,0,3,1],[4,0,4,1],[7,0,7,1],[8,0,8,1],[5,0,5,1],[6,0,6,1],[3,2,3,3]]}
["กรอกชื่อโรงไฟฟ้า....."]
[]
["Year",null,"Duration Hr.",null,null,null,null,null,null,null,null,null,null,null,null,null,null,null,"Input สิทธิการซ่อม"]
[{"$f":"YEAR(NOW())+1","v":2021},null,{"$f":"SUMIF(O24:O83,A4,J24:J83)","v":0}]
[{"$f":"A4+1","v":2022},null,{"$f":"SUMIF(O24:O123,A5,J24:J123)","v":0},null,null,null,null,null,null,null,null,null,null,null,null,null,null,null,null,null,null,"สิทธิการซ่อม","Peak Month"]
[{"$f":"A5+1","v":2023},null,{"$f":"SUMIF(O24:O123,A6,J24:J123)","v":1.9583333333357587},null,null,null,null,null,null,null,null,null,null,null,null,null,null,2020,840,null,2020,{"$f":"IF(C5<=S6,\"Pass\",\"Not Pass\")","v":"Pass"},{"$f":"IF(V24*24<=30,\"Pass\",\"Not Pass\")","v":"Pass"}]
[2024,null,{"$f":"SUMIF(O24:O123,A7,J24:J123)","v":2},null,null,null,null,null,null,null,null,null,null,null,null,null,null,2021,840,null,2021,{"$f":"IF(C6<=S7,\"Pass\",\"Not Pass\")","v":"Pass"},{"$f":"IF(V25*24<=30,\"Pass\",\"Not Pass\")","v":"Pass"}]
[2025,null,{"$f":"SUMIF(O24:O123,A8,J24:J123)","v":0},null,null,null,null,null,null,null,null,null,null,null,null,null,null,2022,840,null,2022,{"$f":"IF(C7<=S8,\"Pass\",\"Not Pass\")","v":"Pass"},{"$f":"IF(V26*24<=30,\"Pass\",\"Not Pass\")","v":"Pass"}]
[2026,null,{"$f":"SUMIF(O24:O123,A9,J24:J123)","v":0},null,null,null,null,null,null,null,null,null,null,null,null,null,null,2023,840,null,2023,{"$f":"IF(C8<=S9,\"Pass\",\"Not Pass\")","v":"Pass"},{"$f":"IF(V27*24<=30,\"Pass\",\"Not Pass\")","v":"Pass"}]
[]
["กรุณาส่งมาที่ : "]
["-","Tonsakul.Kavownark@egat.co.th",null,null,null,null,null,null,null,null,null,null,null,null,null,null,null,2024,840,null,2024,{"$f":"IF(C9<=S12,\"Pass\",\"Not Pass\")","v":"Pass"},{"$f":"IF(V28*24<=30,\"Pass\",\"Not Pass\")","v":"Pass"}]
["-","            Ltop@egat.co.th"]
["หมายเหตุ :"]
["- ในกรณีที่ชั่วโมงสิ้นสุดการทำงานเป็น 24 นาฬิกา ให้ทำการเปลี่ยนวันสิ้นสุดเป็นวันถัดไปที่ 00 นาฬิกาแทน **"]
["- ให้กรอกชื่องานที่จะหยุดซ่อม (กรณีหลาย GT หยุดพร้อมกันให้เขียนในบรรทัดเดียวเพื่อป้องกันการนับชั่วโมงซ้ำ)"]
["- อย่าลืมกรอกจำนวน MW To EGAT"]
["- อย่าลืมกรอกชื่อโรงไฟฟ้า"]
["- อย่าแจ้งแผนบำรุงรักษาข้ามปี เนื่องจากชั่วโมงรวมรายปีจะไม่สามารถคำนวนปีที่ แจ้งวันเริ่มได้ แต่ชั่วโมงรวมทั้งหมดจะถูกรวมไว้ในปีที่สิ้นสุด"]
["Maintenance Schedule"]
["No.","Activity","Start Date","Time",null,"Finish Date","Time",null,"Duration ",null,"MW To EGAT"]
[null,null,null,"Hour","minute",null,"Hour","minute","Day","Hour",null,null,null,null,null,null,null,null,null,null,null,null,null,"Start",null,"Finish"]
[]
["1","Example","2023-01-01",0,0,"2023-01-02",23,0,{"$f":"IFERROR(DATEDIF(T24,S24,\"d\"),\"\")","v":""},{"$f":"IFERROR(Z24-X24,\" \")","v":1.9583333333357587},30,null,null,{"$f":"IFERROR(YEAR(C24),\"-\")","v":2023},{"$f":"IFERROR(YEAR(F24),\"-\")","v":2023},null,null,{"$f":"MONTH(C24)","v":1},{"$f":"MONTH(F24)","v":1},{"$f":"R24&O24","v":"12023"},{"$f":"S24&O24","v":"12023"},{"$f":"SUMIF(U24:U123,32020,J24:J123)+SUMIF(U24:U123,42020,J24:J123)+SUMIF(U24:U123,52020,J24:J123)","v":0},{"$f":"TIMEVALUE(D24&\":\"&E24)","v":"00:00:00"},{"$f":"C24+W24","v":"2023-01-01"},{"$f":"TIMEVALUE(G24&\":\"&H24)","v":"23:00:00"},{"$f":"F24+Y24","v":"2023-01-02T23:00:00"}]
["2","Example","2024-08-01",0,0,"2024-08-03",0,0,{"$f":"IFERROR(DATEDIF(T25,S25,\"d\"),\"\")","v":""},{"$f":"IFERROR(Z25-X25,\" \")","v":2},30,null,null,{"$f":"IFERROR(YEAR(C25),\"-\")","v":2024},{"$f":"IFERROR(YEAR(F25),\"-\")","v":2024},null,null,{"$f":"MONTH(C25)","v":8},{"$f":"MONTH(F25)","v":8},{"$f":"R25&O25","v":"82024"},{"$f":"S25&O25","v":"82024"},{"$f":"SUMIF(U24:U123,32021,J24:J123)+SUMIF(U24:U123,42021,J24:J123)+SUMIF(U24:U123,52021,J24:J123)","v":0},{"$f":"TIMEVALUE(D25&\":\"&E25)","v":"00:00:00"},{"$f":"C25+W25","v":"2024-08-01"},{"$f":"TIMEVALUE(G25&\":\"&H25)","v":"00:00:00"},{"$f":"F25+Y25","v":"2024-08-03"}]
["3",null,null,null,null,null,null,null,null," ",null,null,null,1900,1900,null,null,1,1,"11900","11900",{"$f":"SUMIF(U24:U123,32022,J24:J123)+SUMIF(U24:U123,42022,J24:J123)+SUMIF(U24:U123,52022,J24:J123)","v":0},{"$error":"#VALUE!"},{"$error":"#VALUE!"},{"$error":"#VALUE!"},{"$error":"#VALUE!"}]
["4",null,null,null,null,null,null,null,{"$f":"IFERROR(DATEDIF(T27,S27,\"d\"),\"\")","v":""}," ",null,null,null,1900,{"$f":"IFERROR(YEAR(F27),\"-\")","v":1900},null,null,1,1,"11900","11900",{"$f":"SUMIF(U24:U123,32023,J24:J123)+SUMIF(U24:U123,42023,J24:J123)+SUMIF(U24:U123,52023,J24:J123)","v":0},{"$error":"#VALUE!"},{"$error":"#VALUE!"},{"$error":"#VALUE!"},{"$error":"#VALUE!"}]
["5",null,null,null,null,null,null,null,""," ",null,null,null,1900,{"$f":"IFERROR(YEAR(F28),\"-\")","v":1900},null,null,{"$f":"MONTH(C28)","v":1},1,"11900","11900",{"$f":"SUMIF(U24:U123,32024,J24:J123)+SUMIF(U24:U123,42024,J24:J123)+SUMIF(U24:U123,52024,J24:J123)","v":0},{"$error":"#VALUE!"},{"$error":"#VALUE!"},{"$error":"#VALUE!"},{"$error":"#VALUE!"}]
["6",null,null,null,null,null,null,null,""," ",null,null,null,1900,1900,null,null,1,1,"11900","11900",null,{"$error":"#VALUE!"},{"$error":"#VALUE!"},{"$error":"#VALUE!"},{"$error":"#VALUE!"}]
["7",null,null,null,null,null,null,null,""," ",null,null,null,1900,1900,null,null,1,1,"11900","11900",null,{"$error":"#VALUE!"},{"$error":"#VALUE!"},{"$error":"#VALUE!"},{"$error":"#VALUE!"}]
["8",null,null,null,null,null,null,null,""," ",null,null,null,1900,1900,null,null,1,1,"11900","11900",null,{"$error":"#VALUE!"},{"$error":"#VALUE!"},{"$error":"#VALUE!"},{"$error":"#VALUE!"}]
["9",null,null,null,null,null,null,null,""," ",null,null,null,1900,1900,null,null,1,1,"11900","11900",null,{"$error":"#VALUE!"},{"$error":"#VALUE!"},{"$error":"#VALUE!"},{"$error":"#VALUE!"}]
["10",null,null,null,null,null,null,null,""," ",null,null,null,1900,1900,null,null,1,1,"11900","11900",null,{"$error":"#VALUE!"},{"$error":"#VALUE!"},{"$error":"#VALUE!"},{"$error":"#VALUE!"}]
["11",null,null,null,null,null,null,null,""," ",null,null,null,1900,1900,null,null,1,1,"11900","11900",null,{"$error":"#VALUE!"},{"$error":"#VALUE!"},{"$error":"#VALUE!"},{"$error":"#VALUE!"}]
["12",null,null,null,null,null,null,null,""," ",null,null,null,1900,1900,null,null,1,1,"11900","11900",null,{"$error":"#VALUE!"},{"$error":"#VALUE!"},{"$error":"#VALUE!"},{"$error":"#VALUE!"}]
["13",null,null,null,null,null,null,null,""," ",null,null,null,1900,1900,null,null,1,1,"11900","11900",null,{"$error":"#VALUE!"},{"$error":"#VALUE!"},{"$error":"#VALUE!"},{"$error":"#VALUE!"}]
["14",null,null,null,null,null,null,null,""," ",null,null,null,1900,1900,null,null,1,1,"11900","11900",null,{"$error":"#VALUE!"},{"$error":"#VALUE!"},{"$error":"#VALUE!"},{"$error":"#VALUE!"}]
["15",null,null,null,null,null,null,null,""," ",null,null,null,1900,1900,null,null,1,1,"11900","11900",null,{"$error":"#VALUE!"},{"$error":"#VALUE!"},{"$error":"#VALUE!"},{"$error":"#VALUE!"}]
["16",null,null,null,null,null,null,null,""," ",null,null,null,1900,1900,null,null,1,1,"11900","11900",null,{"$error":"#VALUE!"},{"$error":"#VALUE!"},{"$error":"#VALUE!"},{"$error":"#VALUE!"}]
["17",null,null,null,null,null,null,null,""," ",null,null,null,1900,1900,null,null,1,1,"11900","11900",null,{"$error":"#VALUE!"},{"$error":"#VALUE!"},{"$error":"#VALUE!"},{"$error":"#VALUE!"}]
["18",null,null,null,null,null,null,null,""," ",null,null,null,1900,1900,null,null,1,1,"11900","11900",null,{"$error":"#VALUE!"},{"$error":"#VALUE!"},{"$error":"#VALUE!"},{"$error":"#VALUE!"}]
["19",null,null,null,null,null,null,null,""," ",null,null,null,1900,1900,null,null,1,1,"11900","11900",null,{"$error":"#VALUE!"},{"$error":"#VALUE!"},{"$error":"#VALUE!"},{"$error":"#VALUE!"}]
["20",null,null,null,null,null,null,null,""," ",null,null,null,1900,1900,null,null,1,1,"11900","11900",null,{"$error":"#VALUE!"},{"$error":"#VALUE!"},{"$error":"#VALUE!"},{"$error":"#VALUE!"}]
["21",null,null,null,null,null,null,null,""," ",null,null,null,1900,1900,null,null,1,1,"11900","11900",null,{"$error":"#VALUE!"},{"$error":"#VALUE!"},{"$error":"#VALUE!"},{"$error":"#VALUE!"}]
["22",null,null,null,null,null,null,null,{"$f":"IFERROR(DATEDIF(T45,S45,\"d\"),\"\")","v":""}," ",null,null,null,1900,1900,null,null,1,1,"11900","11900",null,{"$error":"#VALUE!"},{"$error":"#VALUE!"},{"$error":"#VALUE!"},{"$error":"#VALUE!"}]
["23",null,null,null,null,null,null,null,""," ",null,null,null,1900,1900,null,null,1,1,"11900","11900",null,{"$error":"#VALUE!"},{"$error":"#VALUE!"},{"$error":"#VALUE!"},{"$error":"#VALUE!"}]
["24",null,null,null,null,null,null,null,""," ",null,null,null,1900,1900,null,null,1,1,"11900","11900",null,{"$error":"#VALUE!"},{"$error":"#VALUE!"},{"$error":"#VALUE!"},{"$error":"#VALUE!"}]
["25",null,null,null,null,null,null,null,""," ",null,null,null,1900,1900,null,null,1,1,"11900","11900",null,{"$error":"#VALUE!"},{"$error":"#VALUE!"},{"$error":"#VALUE!"},{"$error":"#VALUE!"}]
["26",null,null,null,null,null,null,null,""," ",null,null,null,1900,1900,null,null,1,1,"11900","11900",null,{"$error":"#VALUE!"},{"$error":"#VALUE!"},{"$error":"#VALUE!"},{"$error":"#VALUE!"}]
["27",null,null,null,null,null,null,null,""," ",null,null,null,1900,1900,null,null,1,1,"11900","11900",null,{"$error":"#VALUE!"},{"$error":"#VALUE!"},{"$error":"#VALUE!"},{"$error":"#VALUE!"}]
["28",null,null,null,null,null,null,null,""," ",null,null,null,1900,1900,null,null,1,1,"11900","11900",null,{"$error":"#VALUE!"},{"$error":"#VALUE!"},{"$error":"#VALUE!"},{"$error":"#VALUE!"}]
["29",null,null,null,null,null,null,null,""," ",null,null,null,1900,1900,null,null,1,1,"11900","11900",null,{"$error":"#VALUE!"},{"$error":"#VALUE!"},{"$error":"#VALUE!"},{"$error":"#VALUE!"}]
["30",null,null,null,null,null,null,null,""," ",null,null,null,1900,1900,null,null,1,1,"11900","11900",null,{"$error":"#VALUE!"},{"$error":"#VALUE!"},{"$error":"#VALUE!"},{"$error":"#VALUE!"}]
["31",null,null,null,null,null,null,null,""," ",null,null,null,1900,1900,null,null,1,1,"11900","11900",null,{"$error":"#VALUE!"},{"$error":"#VALUE!"},{"$error":"#VALUE!"},{"$error":"#VALUE!"}]
["32",null,null,null,null,null,null,null,""," ",null,null,null,1900,1900,null,null,1,1,"11900","11900",null,{"$error":"#VALUE!"},{"$error":"#VALUE!"},{"$error":"#VALUE!"},{"$error":"#VALUE!"}]
["33",null,null,null,null,null,null,null,""," ",null,null,null,1900,1900,null,null,1,1,"11900","11900",null,{"$error":"#VALUE!"},{"$error":"#VALUE!"},{"$error":"#VALUE!"},{"$error":"#VALUE!"}]
["34",null,null,null,null,null,null,null,""," ",null,null,null,1900,1900,null,null,1,1,"11900","11900",null,{"$error":"#VALUE!"},{"$error":"#VALUE!"},{"$error":"#VALUE!"},{"$error":"#VALUE!"}]
["35",null,null,null,null,null,null,null,""," ",null,null,null,1900,1900,null,null,1,1,"11900","11900",null,{"$error":"#VALUE!"},{"$error":"#VALUE!"},{"$error":"#VALUE!"},{"$error":"#VALUE!"}]
["36",null,null,null,null,null,null,null,""," ",null,null,null,1900,1900,null,null,1,1,"11900","11900",null,{"$error":"#VALUE!"},{"$error":"#VALUE!"},{"$error":"#VALUE!"},{"$error":"#VALUE!"}]
["37",null,null,null,null,null,null,null,""," ",null,null,null,1900,1900,null,null,1,1,"11900","11900",null,{"$error":"#VALUE!"},{"$error":"#VALUE!"},{"$error":"#VALUE!"},{"$error":"#VALUE!"}]
["38",null,null,null,null,null,null,null,""," ",null,null,null,1900,1900,null,null,1,1,"11900","11900",null,{"$error":"#VALUE!"},{"$error":"#VALUE!"},{"$error":"#VALUE!"},{"$error":"#VALUE!"}]
["39",null,null,null,null,null,null,null,""," ",null,null,null,1900,1900,null,null,1,1,"11900","11900",null,{"$error":"#VALUE!"},{"$error":"#VALUE!"},{"$error":"#VALUE!"},{"$error":"#VALUE!"}]
["40",null,null,null,null,null,null,null,""," ",null,null,null,1900,1900,null,null,1,1,"11900","11900",null,{"$error":"#VALUE!"},{"$error":"#VALUE!"},{"$error":"#VALUE!"},{"$error":"#VALUE!"}]
["41",null,null,null,null,null,null,null,""," ",null,null,null,1900,1900,null,null,1,1,"11900","11900",null,{"$error":"#VALUE!"},{"$error":"#VALUE!"},{"$error":"#VALUE!"},{"$error":"#VALUE!"}]
["42",null,null,null,null,null,null,null,""," ",null,null,null,1900,1900,null,null,1,1,"11900","11900",null,{"$error":"#VALUE!"},{"$error":"#VALUE!"},{"$error":"#VALUE!"},{"$error":"#VALUE!"}]
["43",null,null,null,null,null,null,null,""," ",null,null,null,1900,1900,null,null,1,1,"11900","11900",null,{"$error":"#VALUE!"},{"$error":"#VALUE!"},{"$error":"#VALUE!"},{"$error":"#VALUE!"}]
["44",null,null,null,null,null,null,null,""," ",null,null,null,1900,1900,null,null,1,1,"11900","11900",null,{"$error":"#VALUE!"},{"$error":"#VALUE!"},{"$error":"#VALUE!"},{"$error":"#VALUE!"}]
["45",null,null,null,null,null,null,null,""," ",null,null,null,1900,1900,null,null,1,1,"11900","11900",null,{"$error":"#VALUE!"},{"$error":"#VALUE!"},{"$error":"#VALUE!"},{"$error":"#VALUE!"}]
["46",null,null,null,null,null,null,null,""," ",null,null,null,1900,1900,null,null,1,1,"11900","11900",null,{"$error":"#VALUE!"},{"$error":"#VALUE!"},{"$error":"#VALUE!"},{"$error":"#VALUE!"}]
["47",null,null,null,null,null,null,null,""," ",null,null,null,1900,1900,null,null,1,1,"11900","11900",null,{"$error":"#VALUE!"},{"$error":"#VALUE!"},{"$error":"#VALUE!"},{"$error":"#VALUE!"}]
["48",null,null,null,null,null,null,null,{"$f":"IFERROR(DATEDIF(T71,S71,\"d\"),\"\")","v":""}," ",null,null,null,1900,1900,null,null,1,1,"11900","11900",null,{"$error":"#VALUE!"},{"$error":"#VALUE!"},{"$error":"#VALUE!"},{"$error":"#VALUE!"}]
["49",null,null,null,null,null,null,null,""," ",null,null,null,1900,1900,null,null,1,1,"11900","11900",null,{"$error":"#VALUE!"},{"$error":"#VALUE!"},{"$error":"#VALUE!"},{"$error":"#VALUE!"}]
["50",null,null,null,null,null,null,null,""," ",null,null,null,1900,1900,null,null,1,1,"11900","11900",null,{"$error":"#VALUE!"},{"$error":"#VALUE!"},{"$error":"#VALUE!"},{"$error":"#VALUE!"}]
["51",null,null,null,null,null,null,null,""," ",null,null,null,1900,1900,null,null,1,1,"11900","11900",null,{"$error":"#VALUE!"},{"$error":"#VALUE!"},{"$error":"#VALUE!"},{"$error":"#VALUE!"}]
["52",null,null,null,null,null,null,null,""," ",null,null,null,1900,1900,null,null,1,1,"11900","11900",null,{"$error":"#VALUE!"},{"$error":"#VALUE!"},{"$error":"#VALUE!"},{"$error":"#VALUE!"}]
["53",null,null,null,null,null,null,null,""," ",null,null,null,1900,1900,null,null,1,1,"11900","11900",null,{"$error":"#VALUE!"},{"$error":"#VALUE!"},{"$error":"#VALUE!"},{"$error":"#VALUE!"}]
["54",null,null,null,null,null,null,null,""," ",null,null,null,1900,1900,null,null,1,1,"11900","11900",null,{"$error":"#VALUE!"},{"$error":"#VALUE!"},{"$error":"#VALUE!"},{"$error":"#VALUE!"}]
["55",null,null,null,null,null,null,null,""," ",null,null,null,1900,1900,null,null,1,1,"11900","11900",null,{"$error":"#VALUE!"},{"$error":"#VALUE!"},{"$error":"#VALUE!"},{"$error":"#VALUE!"}]
["56",null,null,null,null,null,null,null,""," ",null,null,null,1900,1900,null,null,1,1,"11900","11900",null,{"$error":"#VALUE!"},{"$error":"#VALUE!"},{"$error":"#VALUE!"},{"$error":"#VALUE!"}]
["57",null,null,null,null,null,null,null,""," ",null,null,null,1900,1900,null,null,1,1,"11900","11900",null,{"$error":"#VALUE!"},{"$error":"#VALUE!"},{"$error":"#VALUE!"},{"$error":"#VALUE!"}]
["58",null,null,null,null,null,null,null,""," ",null,null,null,1900,1900,null,null,1,1,"11900","11900",null,{"$error":"#VALUE!"},{"$error":"#VALUE!"},{"$error":"#VALUE!"},{"$error":"#VALUE!"}]
["59",null,null,null,null,null,null,null,""," ",null,null,null,1900,1900,null,null,1,1,"11900","11900",null,{"$error":"#VALUE!"},{"$error":"#VALUE!"},{"$error":"#VALUE!"},{"$error":"#VALUE!"}]
["60",null,null,null,null,null,null,null,""," ",null,null,null,1900,1900,null,null,1,1,"11900","11900",null,{"$error":"#VALUE!"},{"$error":"#VALUE!"},{"$error":"#VALUE!"},{"$error":"#VALUE!"}]
["61",null,null,null,null,null,null,null,{"$f":"IFERROR(DATEDIF(T84,S84,\"d\"),\"\")","v":""}," ",null,null,null,1900,1900,null,null,1,1,"11900","11900",null,{"$error":"#VALUE!"},{"$error":"#VALUE!"},{"$error":"#VALUE!"},{"$error":"#VALUE!"}]
["62",null,null,null,null,null,null,null,""," ",null,null,null,1900,1900,null,null,1,1,"11900","11900",null,{"$error":"#VALUE!"},{"$error":"#VALUE!"},{"$error":"#VALUE!"},{"$error":"#VALUE!"}]
["63",null,null,null,null,null,null,null,""," ",null,null,null,1900,1900,null,null,1,1,"11900","11900",null,{"$error":"#VALUE!"},{"$error":"#VALUE!"},{"$error":"#VALUE!"},{"$error":"#VALUE!"}]
["64",null,null,null,null,null,null,null,""," ",null,null,null,1900,1900,null,null,1,1,"11900","11900",null,{"$error":"#VALUE!"},{"$error":"#VALUE!"},{"$error":"#VALUE!"},{"$error":"#VALUE!"}]
["65",null,null,null,null,null,null,null,""," ",null,null,null,1900,1900,null,null,1,1,"11900","11900",null,{"$error":"#VALUE!"},{"$error":"#VALUE!"},{"$error":"#VALUE!"},{"$error":"#VALUE!"}]
["66",null,null,null,null,null,null,null,"",{"$f":"IFERROR(Z89-X89,\" \")","v":" "},null,null,null,{"$f":"IFERROR(YEAR(C89),\"-\")","v":1900},{"$f":"IFERROR(YEAR(F89),\"-\")","v":1900},null,null,{"$f":"MONTH(C89)","v":1},{"$f":"MONTH(F89)","v":1},{"$f":"R89&O89","v":"11900"},{"$f":"S89&O89","v":"11900"},null,{"$f":"TIMEVALUE(D89&\":\"&E89)","v":{"$error":"#VALUE!"}},{"$f":"C89+W89","v":{"$error":"#VALUE!"}},{"$f":"TIMEVALUE(G89&\":\"&H89)","v":{"$error":"#VALUE!"}},{"$f":"F89+Y89","v":{"$error":"#VALUE!"}}]
["67",null,null,null,null,null,null,null,""," ",null,null,null,1900,1900,null,null,1,1,"11900","11900",null,{"$error":"#VALUE!"},{"$error":"#VALUE!"},{"$error":"#VALUE!"},{"$error":"#VALUE!"}]
["68",null,null,null,null,null,null,null,""," ",null,null,null,1900,1900,null,null,1,1,"11900","11900",null,{"$error":"#VALUE!"},{"$error":"#VALUE!"},{"$error":"#VALUE!"},{"$error":"#VALUE!"}]
["69",null,null,null,null,null,null,null,""," ",null,null,null,1900,1900,null,null,1,1,"11900","11900",null,{"$error":"#VALUE!"},{"$error":"#VALUE!"},{"$error":"#VALUE!"},{"$error":"#VALUE!"}]
["70",null,null,null,null,null,null,null,""," ",null,null,null,1900,1900,null,null,1,1,"11900","11900",null,{"$error":"#VALUE!"},{"$error":"#VALUE!"},{"$error":"#VALUE!"},{"$error":"#VALUE!"}]
["71",null,null,null,null,null,null,null,""," ",null,null,null,1900,1900,null,null,1,1,"11900","11900",null,{"$error":"#VALUE!"},{"$error":"#VALUE!"},{"$error":"#VALUE!"},{"$error":"#VALUE!"}]
["72",null,null,null,null,null,null,null,""," ",null,null,null,1900,1900,null,null,1,1,"11900","11900",null,{"$error":"#VALUE!"},{"$error":"#VALUE!"},{"$error":"#VALUE!"},{"$error":"#VALUE!"}]
["73",null,null,null,null,null,null,null,""," ",null,null,null,1900,1900,null,null,1,1,"11900","11900",null,{"$error":"#VALUE!"},{"$error":"#VALUE!"},{"$error":"#VALUE!"},{"$error":"#VALUE!"}]
["74",null,null,null,null,null,null,null,""," ",null,null,null,1900,1900,null,null,1,1,"11900","11900",null,{"$error":"#VALUE!"},{"$error":"#VALUE!"},{"$error":"#VALUE!"},{"$error":"#VALUE!"}]
["75",null,null,null,null,null,null,null,""," ",null,null,null,1900,1900,null,null,1,1,"11900","11900",null,{"$error":"#VALUE!"},{"$error":"#VALUE!"},{"$error":"#VALUE!"},{"$error":"#VALUE!"}]
["76",null,null,null,null,null,null,null,""," ",null,null,null,1900,1900,null,null,1,1,"11900","11900",null,{"$error":"#VALUE!"},{"$error":"#VALUE!"},{"$error":"#VALUE!"},{"$error":"#VALUE!"}]
["77",null,null,null,null,null,null,null,""," ",null,null,null,1900,1900,null,null,1,1,"11900","11900",null,{"$error":"#VALUE!"},{"$error":"#VALUE!"},{"$error":"#VALUE!"},{"$error":"#VALUE!"}]
["78",null,null,null,null,null,null,null,""," ",null,null,null,1900,1900,null,null,1,1,"11900","11900",null,{"$error":"#VALUE!"},{"$error":"#VALUE!"},{"$error":"#VALUE!"},{"$error":"#VALUE!"}]
["79",null,null,null,null,null,null,null,""," ",null,null,null,1900,1900,null,null,1,1,"11900","11900",null,{"$error":"#VALUE!"},{"$error":"#VALUE!"},{"$error":"#VALUE!"},{"$error":"#VALUE!"}]
["80",null,null,null,null,null,null,null,""," ",null,null,null,1900,1900,null,null,1,1,"11900","11900",null,{"$error":"#VALUE!"},{"$error":"#VALUE!"},{"$error":"#VALUE!"},{"$error":"#VALUE!"}]
["81",null,null,null,null,null,null,null,""," ",null,null,null,1900,1900,null,null,1,1,"11900","11900",null,{"$error":"#VALUE!"},{"$error":"#VALUE!"},{"$error":"#VALUE!"},{"$error":"#VALUE!"}]
["82",null,null,null,null,null,null,null,""," ",null,null,null,1900,1900,null,null,1,1,"11900","11900",null,{"$error":"#VALUE!"},{"$error":"#VALUE!"},{"$error":"#VALUE!"},{"$error":"#VALUE!"}]
["83",null,null,null,null,null,null,null,""," ",null,null,null,1900,1900,null,null,1,1,"11900","11900",null,{"$error":"#VALUE!"},{"$error":"#VALUE!"},{"$error":"#VALUE!"},{"$error":"#VALUE!"}]
["84",null,null,null,null,null,null,null,""," ",null,null,null,1900,1900,null,null,1,1,"11900","11900",null,{"$error":"#VALUE!"},{"$error":"#VALUE!"},{"$error":"#VALUE!"},{"$error":"#VALUE!"}]
["85",null,null,null,null,null,null,null,""," ",null,null,null,1900,1900,null,null,1,1,"11900","11900",null,{"$error":"#VALUE!"},{"$error":"#VALUE!"},{"$error":"#VALUE!"},{"$error":"#VALUE!"}]
["86",null,null,null,null,null,null,null,""," ",null,null,null,1900,1900,null,null,1,1,"11900","11900",null,{"$error":"#VALUE!"},{"$error":"#VALUE!"},{"$error":"#VALUE!"},{"$error":"#VALUE!"}]
["87",null,null,null,null,null,null,null,""," ",null,null,null,1900,1900,null,null,1,1,"11900","11900",null,{"$error":"#VALUE!"},{"$error":"#VALUE!"},{"$error":"#VALUE!"},{"$error":"#VALUE!"}]
["88",null,null,null,null,null,null,null,""," ",null,null,null,1900,1900,null,null,1,1,"11900","11900",null,{"$error":"#VALUE!"},{"$error":"#VALUE!"},{"$error":"#VALUE!"},{"$error":"#VALUE!"}]
["89",null,null,null,null,null,null,null,""," ",null,null,null,1900,1900,null,null,1,1,"11900","11900",null,{"$error":"#VALUE!"},{"$error":"#VALUE!"},{"$error":"#VALUE!"},{"$error":"#VALUE!"}]
["90",null,null,null,null,null,null,null,""," ",null,null,null,1900,1900,null,null,1,1,"11900","11900",null,{"$error":"#VALUE!"},{"$error":"#VALUE!"},{"$error":"#VALUE!"},{"$error":"#VALUE!"}]
["91",null,null,null,null,null,null,null,""," ",null,null,null,1900,1900,null,null,1,1,"11900","11900",null,{"$error":"#VALUE!"},{"$error":"#VALUE!"},{"$error":"#VALUE!"},{"$error":"#VALUE!"}]
["92",null,null,null,null,null,null,null,""," ",null,null,null,1900,1900,null,null,1,1,"11900","11900",null,{"$error":"#VALUE!"},{"$error":"#VALUE!"},{"$error":"#VALUE!"},{"$error":"#VALUE!"}]
["93",null,null,null,null,null,null,null,""," ",null,null,null,1900,1900,null,null,1,1,"11900","11900",null,{"$error":"#VALUE!"},{"$error":"#VALUE!"},{"$error":"#VALUE!"},{"$error":"#VALUE!"}]
["94",null,null,null,null,null,null,null,""," ",null,null,null,1900,1900,null,null,1,1,"11900","11900",null,{"$error":"#VALUE!"},{"$error":"#VALUE!"},{"$error":"#VALUE!"},{"$error":"#VALUE!"}]
["95",null,null,null,null,null,null,null,""," ",null,null,null,1900,1900,null,null,1,1,"11900","11900",null,{"$error":"#VALUE!"},{"$error":"#VALUE!"},{"$error":"#VALUE!"},{"$error":"#VALUE!"}]
["96",null,null,null,null,null,null,null,""," ",null,null,null,1900,1900,null,null,1,1,"11900","11900",null,{"$error":"#VALUE!"},{"$error":"#VALUE!"},{"$error":"#VALUE!"},{"$error":"#VALUE!"}]
["97",null,null,null,null,null,null,null,""," ",null,null,null,1900,1900,null,null,1,1,"11900","11900",null,{"$error":"#VALUE!"},{"$error":"#VALUE!"},{"$error":"#VALUE!"},{"$error":"#VALUE!"}]
["98",null,null,null,null,null,null,null,""," ",null,null,null,1900,1900,null,null,1,1,"11900","11900",null,{"$error":"#VALUE!"},{"$error":"#VALUE!"},{"$error":"#VALUE!"},{"$error":"#VALUE!"}]
["99",null,null,null,null,null,null,null,""," ",null,null,null,1900,1900,null,null,1,1,"11900","11900",null,{"$error":"#VALUE!"},{"$error":"#VALUE!"},{"$error":"#VALUE!"},{"$error":"#VALUE!"}]
["100",null,null,null,null,null,null,null,""," ",null,null,null,1900,1900,null,null,1,1,"11900","11900",null,{"$error":"#VALUE!"},{"$error":"#VALUE!"},{"$error":"#VALUE!"},{"$error":"#VALUE!"}]

{"sheet":"Sheet2","index":2,"n_rows":25,"n_cols":3,"rows_kept":25,"cut":false,"hidden":true,"merged":[]}
["Hour",null,"Minute"]
[0,null,0]
[1,null,15]
[2,null,30]
[3,null,45]
[4]
[5]
[6]
[7]
[8]
[9]
[10]
[11]
[12]
[13]
[14]
[15]
[16]
[17]
[18]
[19]
[20]
[21]
[22]
[23]

{"sheet":"คู่มือการใช้","index":3,"n_rows":45,"n_cols":11,"rows_kept":45,"cut":false,"hidden":false,"merged":[[45,0,45,11],[39,0,39,11],[40,0,40,11],[41,0,41,11],[34,0,34,11],[35,0,35,11],[36,0,36,11],[37,0,37,11],[38,0,38,11],[28,10,28,11],[29,10,29,11],[30,10,30,11],[3,2,3,3],[33,0,33,11],[23,10,23,11],[24,10,24,11],[25,10,25,11],[26,10,26,11],[27,10,27,11],[20,6,20,7],[20,8,20,9],[20,10,22,11],[21,3,22,3],[21,4,22,4],[21,6,22,6],[17,0,17,5],[19,0,19,10],[21,7,22,7],[21,8,22,8],[21,9,22,9],[20,0,22,0],[20,1,22,1],[20,2,22,2],[20,3,20,4],[20,5,22,5],[8,0,8,1],[8,2,8,3],[14,0,14,1],[15,0,15,5],[16,0,16,5],[5,0,5,1],[5,2,5,3],[6,0,6,1],[6,2,6,3],[7,0,7,1],[7,2,7,3],[0,0,1,3],[2,0,2,1],[2,2,2,3],[3,0,3,1],[4,0,4,1],[4,2,4,3]]}
["กรอกชื่อโรงไฟฟ้า....."]
[]
["Year",null,"Duration Hr."]
[{"$f":"YEAR(NOW())+1","v":2021},null,{"$f":"SUMIF(N24:N81,2019,J24:J81)","v":0}]
[{"$f":"A4+1","v":2022},null,{"$f":"SUMIF(N24:N121,A5,J24:J121)","v":0}]
[{"$f":"A5+1","v":2023},null,{"$f":"SUMIF(N24:N121,A6,J24:J121)","v":0}]
[2024,null,{"$f":"SUMIF(N24:N121,A7,J24:J121)","v":0}]
[2025,null,{"$f":"SUMIF(N24:N121,A8,J24:J121)","v":0}]
[2026,null,{"$f":"SUMIF(N24:N121,A9,J24:J121)","v":0}]
[]
["กรุณาส่งมาที่ : "]
["-","Tonsakul.Kavownark@egat.co.th"]
["-","            Ltop@egat.co.th"]
[]
["หมายเหตุ :"]
["- ให้กรอกชื่องานที่จะหยุดซ่อม (กรณีหลาย GT หยุดพร้อมกันให้เขียนในบรรทัดเดียวเพื่อป้องกันการนับชั่วโมงซ้ำ)"]
["- อย่าลืมกรอกจำนวน MW To EGAT"]
["- อย่าลืมกรอกชื่อโรงไฟฟ้า"]
[]
["Maintenance Schedule"]
["No.","Activity","Planned Outage Date","Time",null,"Finish Date","Time",null,"Duration ",null,"MW To EGAT"]
[null,null,null,"Hour","minute",null,"Hour","minute","Day","Hr."]
[]
["1",null,null,null,null,null,null,null,{"$f":"IFERROR(DATEDIF(S24,R24,\"d\"),\"\")","v":0},{"$f":"IFERROR(Y24-W24,\" \")","v":0}]
["2",null,null,null,null,null,null,null,{"$f":"IFERROR(DATEDIF(S25,R25,\"d\"),\"\")","v":0},{"$f":"IFERROR(Y25-W25,\" \")","v":0}]
["3",null,null,null,null,null,null,null,{"$f":"IFERROR(DATEDIF(S26,R26,\"d\"),\"\")","v":0},0]
["4",null,null,null,null,null,null,null,0,0]
["5",null,null,null,null,null,null,null,0,0]
["6",null,null,null,null,null,null,null,0,0]
["7",null,null,null,null,null,null,null,0,0]
["8",null,null,null,null,null,null,null,0,0]
[]
[]
["คู่มือการใช้งาน"]
["1. ให้กรอกชื่องานซ่อม (กรณีหลาย GT หยุดซ่อมพร้อมกันให้กรอกมาในบรรทัดเดียวกันเพื่อป้องกันการนับชั่วโมงซ้ำ)"]
["2. วันเริ่มหยุดซ่อม วัน/เดือน/คศ. (ให้ Double Click ที่ช่อง)"]
["3. ให้กรอกเวลาเริ่ม Click Drop Down เพื่อเลือกเวลา"]
["4. นาทีเริ่ม Click Drop Down เพื่อเลือกนาที"]
["5. วันสิ้นสุดของการหยุดซ่อม วัน/เดือน/คศ. (ให้ Double Click ที่ช่อง)"]
["6. ใส่ MW To EGAT"]
["7. ให้ระบุชื่อ รฟ."]
[]
["หมายเหตุ :"]
["**** อย่าแจ้งแผนบำรุงรักษาข้ามปี เนื่องจากชั่วโมงรวมรายปีจะไม่สามารถคำนวนปีที่ แจ้งวันเริ่มได้ แต่ชั่วโมงรวมทั้งหมดจะถูกรวมไว้ในปีที่สิ้นสุด"]
["**** ในกรณีที่ชั่วโมงสิ้นสุดการทำงานเป็น 24 นาฬิกา ให้ทำการเปลี่ยนวันสิ้นสุดเป็นวันถัดไปที่ 00 นาฬิกาแทน"]